Georgia Superior Court - McIntosh County
type: Class
subclass of: RCBE5bLTCIia7wAstjMsnKO
definition: Georgia Superior Court - McIntosh County refers to a specific court within the Georgia Superior Court system that has jurisdiction over legal matters within McIntosh County.