Stipulated Judgment
type: Class
alternative label: 约定判决
subclass of: R9jpIjzc10qdgl78jXOZtfm
definition: A stipulated judgment is a legal decision agreed upon by both parties involved in a case, which is then approved by a judge.