Statute of Repose
type: Class
alternative label: 时效法规
subclass of: RDJM7d52FqDzFaBbtRdhECs
definition: A Statute of Repose is a legal time limit that restricts the period within which a lawsuit can be filed, regardless of when the injury or harm occurred or was discovered. It is usually tied to the completion of a specific event or transaction, such as the sale of a product or the completion of construction.