Sexual Harassment
type: Class
alternative label: 性骚扰
subclass of: RwadSStLIBnmEe8euTpNYP
definition: Sexual Harassment: Unwelcome sexual advances, requests for sexual favors, and other verbal or physical conduct of a sexual nature that creates a hostile or offensive work environment.