Sexual Assault with an Object
type: Class
alternative label: 使用物品进行性侵犯
subclass of: R8fcGNgScyMlOAFxW5Omw5Y
definition: To use an object or instrument to unlawfully penetrate, however slightly, the genital or anal opening of the body of another person, forcibly and/or against that person’s will or not forcibly or against the person’s will in instances where the victim is incapable of giving consent because of his/her youth or because of his/her temporary or permanent mental or physical incapacity.