Liquidation of Assets
type: Class
preferred label: Asset Liquidation
alternative label: 资产清算
subclass of: R9pQxz2fUIrk1LjvVP8hikg
subclass of: RDKm1RXP9FfvhLzWjynAfpS
subclass of: RsaC1DeVmdIpw8YKXA9JNt
definition: The liquidation of assets refers to the process of selling off a debtor's property in order to satisfy a judgment or debt, as part of the enforcement of a court order.