work_location_country
type: Class
subclass of: R8ktJqdQifgzEaV2DJkdMZa
subclass of: R9VdnoybnEodiN0EUTedSOz
definition: "The country of where work associated with the fee item was performed, to support the taxes appearing in the TAX_ITEM_EXPENSE Segment. Use ISO 3166 country code set forth by International Standards Organization (www.iso.org.) "