BBPLC Clause
type: Class
alternative label: BBPLC条款
subclass of: RDe0RKU39BlhcyACJW30ZLc
definition: A BBPLC Clause is a specific type of contractual clause that is used in legal agreements drafted by the law firm Berwin Leighton Paisner (BLP).