tax_tiers
type: Class
subclass of: RBZL31YCqZA1E1vlIkzRRqw
definition: """tax_tiers"" = Y only where there are different tax rates applicable to billed tiers. If Tiered Tax = ""Y"", the LEDES invoice should contain only one matter; multiple matters/invoice are not allowed for Tiered Taxes. "