Reinvestment Risk
type: Class
subclass of: R98HKldfU8zFYR50z1T3Yn4
definition: The risk that an investor will be unable to reinvest cash flows (like interest payments) at a rate comparable to their current rate of return.