Commercial Finance Law
type: Class
alternative label: 商业金融法
subclass of: RDhhApr0eDVle3F076WAVct
hidden label: COMF
definition: Law supporting the function of providing loans or other financing to businesses.