Bond
type: Class
alternative label: 债券
subclass of: R88D8i8AcSTUig2X3yPbFHg
definition: A bond (agreement) is a legally binding contract between two or more parties that outlines the terms and conditions of a financial arrangement, typically involving the lending or borrowing of money.