Peremptory Challenge
type: Class
preferred label: Peremptory Strike
alternative label: 排斥权
subclass of: R8zwKGkogGKIKWSVWb1ItRL
definition: A peremptory challenge is a motion made during a trial to remove a potential juror or judge without stating a reason, typically limited in number, and used to ensure a fair and impartial trial.