Venda
type: Class
alternative label: 文达
subclass of: RDOvAHsvY8TKJ1O1orXPM9o
definition: Venda (Language) is a structured system of communication that consists of grammar and vocabulary specific to the Venda people of South Africa.