Easement Agreement
type: Class
subclass of: R7I7inwWLqKi8ZMm0Ey6dkK
definition: An Easement Agreement allows one party the right to use a portion of another party's property for a specific purpose, like utilities or driveway access, without owning or possessing it.