Answer with Counterclaims
type: Class
alternative label: 以反诉答辩
subclass of: R2EyNORGNyiB9mHeePFGD
definition: Answer with Counterclaims: A response to a legal claim that includes additional claims made by the defendant against the plaintiff.