315 Airplane Product Liability (PACER NoS)
type: Class
subclass of: R723CZDeI1c9CzFdyGi58Xd
definition: Action alleging personal injury or death from an air crash or other occurrence involving an airplane and caused by a defective product.