disc_cred_note
type: Class
subclass of: R9JDOjlrvV3jFpUOQu9WGhP
subclass of: RByhWBQBS3KV6tj8TwFXRPd
subclass of: RRd84bRRbTvy2WWd1k4wT4
definition: Identification of the discount or credit identified in the disc_credit field as "Other", using codes specified by the client.