Connecticut Court of Appeals
type: Class
subclass of: RCA58c946F878FBE800274a0
definition: The Connecticut Court of Appeals is a specific intermediate appellate court within the Connecticut State Courts system, responsible for hearing appeals from lower courts in the state.