Post-Trial Practice
type: Class
alternative label: 审判后实践
subclass of: RBgzWJQz52CrObfGXDKH1t7
definition: Post-Trial Practice refers to the legal work performed after a trial has concluded, including motions and submissions related to the outcome of the trial.