Abnormal Dangers on Land
type: Class
alternative label: 陆地上的异常危险
subclass of: RdLt8myHW8a9xutd93BnoT
definition: Abnormal Dangers on Land refers to hazardous conditions or situations that exist on a property, which are not typical or expected, and may pose a risk of harm to children who are attracted to the property.