Indiana Circuit Court - Monroe County Circuit 5
type: Class
subclass of: RCeiXNGpqL4H3jo1g1NobSm
definition: A court of general jurisdiction in Indiana that has the authority to hear and decide a wide range of legal cases within Monroe County.