disc_cred_type
type: Class
subclass of: R9JDOjlrvV3jFpUOQu9WGhP
subclass of: RByhWBQBS3KV6tj8TwFXRPd
subclass of: RRd84bRRbTvy2WWd1k4wT4
definition: "Type of discount or credit, applied to the matter/invoice. Valid values are ""Percent"" and ""Flat"". If disc_cred equals ""MIDHR"" or ""Other"", disc_cred_type must be ""Flat"". "