Motion to Stay Proceedings Pending Settlement
type: Class
alternative label: 暂停诉讼程序等待和解动议
subclass of: R8OXAl4XER5P7DRJEzq7Hg7
subclass of: R8r0fE60KG2VwRq1OwbjEUY
definition: A Motion to Stay Proceedings Pending Settlement is a legal request to temporarily halt a case until the parties involved can reach a settlement agreement.