UTBMS MF20 Data Security / Privacy / Data Protection / Cyber Security
type: Class
subclass of: R9d2DkaIPGh2tQoNNOoEBMu
definition: UTBMS MF20 Data Security / Privacy / Data Protection / Cyber Security refers to the classification of legal services related to the protection of data and information in the context of mergers and acquisitions.