Bankruptcy, Insolvency, and Restructuring Law
type: Class
alternative label: 破产和重组法
subclass of: RSYBzf149Mi5KE0YtmpUmr
hidden label: BKCY
definition: Laws relating to insolvent individuals and companies.
note: Added "Insolvency" to rdfs:label, per UK law (where "insolvency" differs from "bankruptcy"). In the UK, individuals and companies can be "insolvent," but companies cannot file for "bankruptcy."