Massachusetts Superior Court - Nantucket County
type: Class
subclass of: RC183ad9FF4a9997835C1019
definition: A court located in Nantucket County that has jurisdiction over civil and criminal cases within its geographical area.