Judgment Notwithstanding the Verdict
type: Class
alternative label: 判决不顾裁决
subclass of: R9jpIjzc10qdgl78jXOZtfm
definition: JNOV or Judgment Notwithstanding the Verdict is a legal concept that allows a judge to overturn a jury's verdict if it is deemed unreasonable or unsupported by the evidence presented at trial.