Employment Application Process
type: Class
alternative label: 就业申请流程
subclass of: R7rEmc9PaAz1JI1YpYZGaDg
definition: The Employment Application Process (Bankruptcy) refers to the legal procedures and requirements involved in filing for bankruptcy as it relates to employment of bankruptcy professionals.