Warranty Clause
type: Class
alternative label: 保证条款
subclass of: R9JIe7aURW35qmdzdEaQwQ4
definition: A Warranty Clause is a contractual provision in which one party guarantees the truth of certain facts or promises to perform certain obligations and assumes liability for any breach of such guarantees or promises.