Process Mapping Management
type: Class
subclass of: RCBPerly9Ql2EqjR3jCfB37
definition: Process Mapping Management refers to the systematic documentation, analysis, and improvement of legal processes in order to increase efficiency and effectiveness, and reduce costs and errors.