Concert of Action Crimes
type: Class
alternative label: 行动演唱会罪
subclass of: R5jFFdAx82IJWPe4JDkFqg
subclass of: R7u1GstOpfAmZ3mI7yFcbgU
subclass of: RSRxb9psAJdqf8rppoiYI8
definition: Concert of Action Crimes refer to a group of criminal offenses where two or more individuals work together to commit a crime, and each member of the group is held responsible for the actions of the others.