Prima Facie Tort
type: Class
alternative label: 初步侵权
subclass of: R8jYAnNATrfoBxAtIKpf72X
definition: Prima Facie Tort is a civil claim that allows a plaintiff to seek damages for intentional harm caused by the defendant, without the need to prove any specific legal duty or relationship between the parties.