Triple Net Lease Clause
type: Class
alternative label: 三重净租赁条款
subclass of: RDe0RKU39BlhcyACJW30ZLc
definition: A Triple Net Lease Clause is a provision in a contract that requires the tenant to pay for all expenses related to the property, including taxes, insurance, and maintenance costs.