Receipt of Verdict
type: Class
alternative label: 收到判决书
subclass of: Rchny3YFXoQyenv6XUbyo0
definition: Receipt of Verdict: The formal acceptance and recording of the decision made by a judge or jury at the end of a trial.