Civil Claims
type: Class
preferred label: Civil Cause of Action
alternative label: 民事索赔
subclass of: R9q7GJc1zsYT0P4Xdp6l9Oz
definition: Civil Claims are legal actions brought by one party against another for a non-criminal matter, such as a breach of contract or personal injury, and seek monetary damages or other relief.