Reasonable Act or Omission
type: Class
alternative label: 合理行为或不作为
subclass of: RCHbjppawvAlt5WcUyfjeN8
definition: An act or failure to act that a reasonable person would or would not do, which is used as a standard to determine liability in cases involving the condition of public property and governmental immunity.