L390 Other Discovery
type: Class
subclass of: R77nPY8Gvlle6KPxDEXlNkM
definition: L390 Other Discovery refers to the process of obtaining information through means other than formal discovery methods, such as through informal interviews or public records requests.