Joint Enterprise Claim
type: Class
alternative label: 联合企业索赔
subclass of: R9JkfZIjkVSa5ud1tJ14w3i
definition: A Joint Enterprise Claim is a legal claim that holds multiple parties responsible for a wrongful act or omission committed in the course of a joint venture or enterprise, and is a type of Corporate and Partnership Liability Claim.