Kara-Kalpak
type: Class
alternative label: 卡拉卡尔帕克语
subclass of: RDOvAHsvY8TKJ1O1orXPM9o
definition: Kara-Kalpak is a language that belongs to the Turkic language family and is spoken primarily in Uzbekistan.