Termination of Employment Clause
type: Class
alternative label: 终止雇佣条款
subclass of: R355Le1zLujnXiHMmYqQNM
definition: A Termination of Employment Clause is a provision in a contract that outlines the conditions under which an employer may end the employment relationship with an employee.