expense segment
type: Class
subclass of: RC3hDYvR4ffxmqJg2F8YGT6
definition: Expense segment refers to a specific component within the LEDES XML E-Billing Ver. 2.2 standard, which includes information such as charge date, units, work location, expense code, and total amount for billing purposes.