Louisiana Department of Labor - Office of Workers' Compensation
type: Class
subclass of: R99F253EB4991DD4767D3f46
definition: The Louisiana Department of Labor - Office of Workers' Compensation is a government agency responsible for administering workers' compensation proceedings in Louisiana State Courts.