Lease Termination Clause
type: Class
alternative label: 租赁终止条款
subclass of: RDe0RKU39BlhcyACJW30ZLc
definition: A lease termination clause is a provision in a contract that outlines the conditions under which a lease agreement can be ended before its natural expiration date.