Early Termination Clause
type: Class
alternative label: 提前终止条款
subclass of: RDe0RKU39BlhcyACJW30ZLc
definition: An Early Termination Clause is a provision in a contract that allows one or both parties to end the agreement before its natural expiration date.