Physical Elder Abuse
type: Class
alternative label: 老年人身体虐待
subclass of: RxwfbvWrxjdHqJhrBu3RWT
definition: Physical Elder Abuse: The intentional use of force against an elderly person that results in physical pain, injury, or impairment.