Indiana Superior Court - Morgan County, Superior Court2
type: Class
subclass of: R7uq2Mq8qLUybQoDhVczzZ5
definition: A court of general jurisdiction in Morgan County, Indiana, with authority over civil and criminal cases.