Misappropriation of Name
type: Class
alternative label: 冒名顶替
subclass of: Rd7uelGFqCTWSgf9lWki5N
definition: The Misappropriation of Name is a legal claim that arises when someone uses another person's name or likeness for commercial gain without their consent.