Warehouse/Logistics - Real Estate Asset
type: Class
alternative label: 仓库/物流 - 房地产资产
subclass of: RBW7QMNsjTXbouCQpRF7NM7
definition: A Warehouse/Logistics - Real Estate Asset is a type of industrial and logistics real estate that is used for the storage and distribution of goods.