Alternative Liability
type: Class
alternative label: 替代责任
subclass of: R9b5fs8QJuliSZYeaJLJU2t
definition: A legal concept where multiple parties may be held liable for damages or harm caused to another, even if it is unclear which specific party was responsible for the harm.